{"text_format":"1","workbook":"xlsx","n_sheets":4,"sheets":["Veri Girişi","Ahsap","Lamine","Kurlar"],"not_rendered":{"charts":0,"images":2,"macros":1,"external_links":0,"defined_names":3,"comments":0,"pivot_tables":0},"unopened":[],"bounds":{"document_bytes":16777216,"sheet_cells":100000,"rows_first":2000,"rows_last":500,"rows_between":2000,"halvings":0,"cell_chars":16384,"cell_head_chars":4096},"cells_cut":0,"cells_raw":0,"read":"whole","date_system":"1900"}

{"sheet":"Veri Girişi","index":0,"n_rows":4,"n_cols":7,"rows_kept":4,"cut":false,"hidden":false,"merged":[]}
["kayıt adresi"]
[]
["Sicil","ilgili kişi","Firma","Unvan","Grup","Çalışan Mail Adresi","Toplam CC"]
["kayalarkereste@hotmail.com",{"$f":"Ahsap!C3","v":"Yetkili İsmi"},{"$f":"Ahsap!C2","v":"Firma İsmi"},{"$f":"Ahsap!C2","v":"Firma İsmi"},"grup","kayalarkereste@hotmail.com"]

{"sheet":"Ahsap","index":1,"n_rows":54,"n_cols":26,"rows_kept":54,"cut":false,"hidden":false,"merged":[[1,2,1,4],[2,2,2,5],[3,2,3,5],[6,11,7,11],[52,1,52,13],[11,1,11,12],[9,3,9,5],[48,6,48,8],[48,10,48,12],[50,1,50,13],[51,1,51,13],[44,6,44,8],[44,10,44,12],[46,6,46,8],[46,10,46,12],[47,10,47,12],[41,6,41,8],[41,10,41,12],[43,10,43,12],[29,1,29,2],[31,1,31,2],[22,1,22,2],[23,1,23,2],[24,1,24,2],[25,1,25,2],[26,1,26,2],[9,23,10,23],[10,1,10,2],[12,1,12,2],[13,1,13,2],[14,1,14,2],[9,15,9,17],[9,18,10,18],[9,19,10,19],[9,20,10,20],[9,22,10,22],[4,3,4,12],[15,1,15,2],[16,1,16,2],[17,1,17,2],[8,8,9,12],[53,2,53,12],[41,1,48,5],[34,1,34,2],[38,1,38,2],[18,1,18,2],[19,1,19,2],[20,1,20,2],[21,1,21,2],[42,6,42,8],[42,10,42,12],[43,6,43,8],[32,1,32,2],[33,1,33,2],[27,1,27,2],[28,1,28,2],[30,1,30,2]]}
[null,null,"Programı  İndir yeni versiyon denetle      2025-Ocak-30",null,null,null,null,null,null,null,null,null,null,null,null,"opsiyon","vade","Teslimat","Stok",null,"Temel Birim","Temel Para","Cinsi","Fiyatı","Fiyatın birimi","Para Birimi"]
[null,"Firma :","Firma İsmi",null,null,null,null,null,null,null,null,null,null,null,null,"7 Gün","Nakit","Fabrikamızda kamyon üstü teslim","Hazır Değil",null,"M3","TL","İnşaatlık Kereste",1300,"M3",{"$f":"V2","v":"TL"}]
[null,"İlgili :","Yetkili İsmi",null,null,null,null,null,null,null,null,null,null,null,null,"15 Gün","30 Gün","Nakliye Dahil Müşteri Adrese Teslim","Yarı Hazır Ürün",null,"Adet","USD","Lambiri - Rabıta",50,"M2",{"$f":"V2","v":"TL"}]
[null,"Mail :","mail@mail.com",null,null,null,null,null,null,null,null,null,null,null,null,"30 Gün","60 Gün",null,"Hazır Ürün",null,"Metre","EUR","Alın Tahtası",40,"Metre",{"$f":"V2","v":"TL"}]
[null,"GSM :","532 000 00 00",null,null,null,null,null,null,null,null,null,null,null,null,null,null,null,null,null,"M2",null,"Süpürgelik",4,"Metre","TL"]
[null,"Opsiyon :",{"$f":"P2","v":"7 Gün"},null,null,null,null,null,null,null,"Orman Ürünleri San. Tic. Ltd. Şti.",null,null,null,null,null,null,null,null,null,null,null,"Lamine Ahşap",4200,"M3","TL"]
[null,"Vade :",{"$f":"Q2","v":"Nakit"},null,null,null,null,null,null,null,null,null,{"$f":"Kurlar!K9/10000","v":35.771000000000001},null,null,null,null,null,null,null,null,null,"İroko DECK",30,"M2","EUR"]
[null,"Teslimat :",{"$f":"R2","v":"Fabrikamızda kamyon üstü teslim"},null,null,null,null,null,null,null,null,null,{"$f":"Kurlar!K12/10000","v":37.253399999999999},null,null,null,null,null,null,null,null,null,"İroko Kereste",1100,"M3","EUR"]
[null,"Stok :","Yarı Hazır Ürün",null,null,null,null,null,{"$f":"TODAY()","v":"2025-01-30"},null,null,null,null,null,null,null,null,null,null,null,null,null,"Deneme ürün 4",104]
[null,null,null,"cm"]
[null,"CİNSİ",null,"En","Kln","Boy","Adet",null,"Fiyat","P.Br","Miktar","Birim","Tutar"]
[null,{"$f":"IFERROR(VLOOKUP(#REF!,#REF!,5,FALSE),\"\")","v":""}]
[null,"İnşaatlık Kereste",null,10,2.5,300,400,null,8500,"TL",{"$f":"IFERROR(\nIF(L13=\"M3\",D13*E13*F13*G13/1000,\nIF(L13=\"Adet\",G13,\nIF(L13=\"Metre\",G13*F13/100,\nIF(L13=\"M2\",D13*F13*G13/10000,\n\"\")))),\"\")","v":3000},{"$f":"IF(B13=$W$2,$Y$2,\nIF(B13=$W$3,$Y$3,\nIF(B13=$W$4,$Y$4,\nIF(B13=$W$5,$Y$5,\nIF(B13=$W$6,$Y$6,\nIF(B13=$W$7,$Y$7,\nIF(B13=$W$8,$Y$8,\nIF(B13=$W$9,$Y$9,\nIF(D13*E13*F13>=1,$U$2,\nIF(D13*F13>=1,$U$5,\nIF(AND(D13+E13+F13>1,G13>1),$U$4,\nIF(AND(D13*E13*F13<1,G13>1),$U$3,\n\"\"))))))))))))","v":"M3"},{"$f":"IF(J13=$V$4,\nIFERROR(IF(L13=\"M3\",K13*I13/1000,IF(L13=\"Adet\",G13*I13,IF(L13=\"Metre\",G13*I13,IF(L13=\"M2\",D13*F13*G13*I13/10000,\"\")))),\"\")*$M$8,\nIF(J13=$V$3,\nIFERROR(IF(L13=\"M3\",K13*I13/1000,IF(L13=\"Adet\",G13*I13,IF(L13=\"Metre\",G13*I13,IF(L13=\"M2\",D13*F13*G13*I13/10000,\"\")))),\"\")*$M$7,\nIF(J13=$V$2,\nIFERROR(IF(L13=\"M3\",K13*I13/1000,IF(L13=\"Adet\",G13*I13,IF(L13=\"Metre\",G13*I13,IF(L13=\"M2\",D13*F13*G13*I13/10000,\"\")))),\"\"),\n\"\")))","v":25500},null,null,null,{"$f":"IFERROR(HYPERLINK(CONCATENATE(\"https://api.whatsapp.com/send?phone=+90\",(C5),\"&text=Sayın yetkili, merhaba. Hesap ile ilgili detayları gönderiyoruz.\"),\"watsapp\"),\"Linte Hata !\")","v":"watsapp"}]
[null,null,null,null,null,null,null,null,{"$f":"\nIF(B14=$W$2,$X$2,\nIF(B14=$W$3,$X$3,\nIF(B14=$W$4,$X$4,\nIF(B14=$W$5,$X$5,\nIF(B14=$W$6,$X$6,\nIF(B14=$W$7,$X$7,\nIF(B14=$W$8,$X$8,\nIF(B14=$W$9,$X$9,\n\n\"\"))))))))","v":""},{"$f":"IF(B14=$W$2,$Z$2,\nIF(B14=$W$3,$Z$3,\nIF(B14=$W$4,$Z$4,\nIF(B14=$W$5,$Z$5,\nIF(B14=$W$6,$Z$6,\nIF(B14=$W$7,$Z$7,\nIF(B14=$W$8,$Z$8,\nIF(B14=$W$9,$Z$9,\nIF(D14*E14*F14>=1,$V$2,\nIF(D14*F14>=1,$V$2,\nIF(AND(D14+E14+F14>1,G14>1),$V$2,\nIF(AND(D14*E14*F14<1,G14>1),$V$2,\n\"\"))))))))))))","v":""},{"$f":"IFERROR(IF(L14=\"M3\",D14*E14*F14*G14/1000,IF(L14=\"Adet\",G14,IF(L14=\"Metre\",G14*F14/100,IF(L14=\"M2\",D14*F14*G14/10000,\"\")))),\"\")","v":""},{"$f":"IF(B14=$W$2,$Y$2,\nIF(B14=$W$3,$Y$3,\nIF(B14=$W$4,$Y$4,\nIF(B14=$W$5,$Y$5,\nIF(B14=$W$6,$Y$6,\nIF(B14=$W$7,$Y$7,\nIF(B14=$W$8,$Y$8,\nIF(B14=$W$9,$Y$9,\nIF(D14*E14*F14>=1,$U$2,\nIF(D14*F14>=1,$U$5,\nIF(AND(D14+E14+F14>1,G14>1),$U$4,\nIF(AND(D14*E14*F14<1,G14>1),$U$3,\n\"\"))))))))))))","v":""},""]
[null,null,null,null,null,null,null,null,"","",{"$f":"IFERROR(IF(L15=\"M3\",D15*E15*F15*G15/1000,IF(L15=\"Adet\",G15,IF(L15=\"Metre\",G15*F15/100,IF(L15=\"M2\",D15*F15*G15/10000,\"\")))),\"\")","v":""},"",""]
[null,null,null,null,null,null,null,null,"","",{"$f":"IFERROR(IF(L16=\"M3\",D16*E16*F16*G16/1000,IF(L16=\"Adet\",G16,IF(L16=\"Metre\",G16*F16/100,IF(L16=\"M2\",D16*F16*G16/10000,\"\")))),\"\")","v":""},"",""]
[null,null,null,null,null,null,null,null,"","","","",""]
[null,null,null,null,null,null,null,null,"","","","",""]
[null,null,null,null,null,null,null,null,"","","","",""]
[null,null,null,null,null,null,null,null,"","","","",""]
[null,null,null,null,null,null,null,null,"","","","","",null," "]
[null,null,null,null,null,null,null,null,"","","","",""]
[null,null,null,null,null,null,null,null,"","","","","",null,null,null,null,4.0999999999999996,"x",9.1,"ölçü ve ",8500,"TL den alınan kereste"]
[null,null,null,null,null,null,null,null,"","","","",""]
[null,null,null,null,null,null,null,null,"","","","","",null,null,null,null,{"$f":"IF(COUNTA(R23)>=1,IF(R23<4,2.6,IF(R23<5.1,5,IF(R23<10.1,10,IF(R23<15,15)))),\"\")","v":5},"x",{"$f":"IF(COUNTA(T23)>=1,IF(R25=2.6,10,IF(T23<5,5,IF(T23<10.1,10,IF(R23<15,15)))),\"\")","v":10},"olarak",{"$f":"R23*T23*V23/R25/T25","v":6342.6999999999989},"TL ye mal olmuş Olur"]
[null,null,null,null,null,null,null,null,"","","","",""]
[null,null,null,null,null,null,null,null,"","","","",""]
[null,null,null,null,null,null,null,null,{"$f":"\nIF(B28=$W$2,$X$2,\nIF(B28=$W$3,$X$3,\nIF(B28=$W$4,$X$4,\nIF(B28=$W$5,$X$5,\nIF(B28=$W$6,$X$6,\nIF(B28=$W$7,$X$7,\nIF(B28=$W$8,$X$8,\nIF(B28=$W$9,$X$9,\n\n\"\"))))))))","v":""},"","","",""]
[null,null,null,null,null,null,null,null,"","","","",""]
[null,null,null,null,null,null,null,null,"","","","",""]
[null,null,null,null,null,null,null,null,"","","","",""]
[null,null,null,null,null,null,null,null,"","","","",""]
[null,null,null,null,null,null,null,null,"","","","",""]
[null,null,null,null,null,null,null,null,"","","","",""]
[null,null,null,null,null,null,null,null,"","","","",""]
[null,null,null,null,null,null,null,null,null,"",null,null,""]
[null,null,null,null,null,null,null,null,null,"",null,null,""]
[null,null,null,null,null,null,null,null,null,"",null,null,""]
[null,null,null,null,null,null,null,null,{"$f":"\nIF(B39=$W$2,$X$2,\nIF(B39=$W$3,$X$3,\nIF(B39=$W$4,$X$4,\nIF(B39=$W$5,$X$5,\nIF(B39=$W$6,$X$6,\nIF(B39=$W$7,$X$7,\nIF(B39=$W$8,$X$8,\nIF(B39=$W$9,$X$9,\n\n\"\"))))))))","v":""},"","","",""]
[null,null,null,null,null,null,{"$f":"SUM(G13:G39)","v":400},null,null,null,{"$f":"SUM(K13:K39)","v":3000},null,25500]
[null,"Not:","( Alt + Enter )"]
[null,null,null,null,null,null,{"$f":"CONCATENATE(U2, \" Tutar :\")","v":"M3 Tutar :"},null,null,null,{"$f":"SUMIFS($M$13:$M$39,L13:L39,U2)","v":25500},null,null,null,{"$f":"SUMIF(L13:L39,U2,M13:M39)","v":25500}]
[null,null,null,null,null,null,{"$f":"CONCATENATE(U3, \" Tutar :\")","v":"Adet Tutar :"},null,null,null,{"$f":"SUMIFS($M$13:$M$39,L13:L39,U3,L13:L39,U3)","v":0}]
[null,null,null,null,null,null,{"$f":"CONCATENATE(U4, \" Tutar :\")","v":"Metre Tutar :"},null,null,null,{"$f":"SUMIFS($M$13:$M$39,L13:L39,U4,L13:L39,U4)","v":0},null,null,null,{"$f":"SUMIF(L13:L39,\"=M3\",M13:M39)","v":25500}]
[null,null,null,null,null,null,{"$f":"CONCATENATE(U5, \" Tutar :\")","v":"M2 Tutar :"},null,null,null,{"$f":"SUMIFS($M$13:$M$39,L13:L39,U5,L13:L39,U5)","v":0}]
[]
[null,null,null,null,null,null,"Ara Toplam :",null,null,null,{"$f":"SUM(M13:M39)","v":25500},null,null,null,{"$f":"SUMIF(L13:L39,\"<>\",M13:M39)","v":25500}]
[null,null,null,null,null,null,"KDV:",null,0.2,null,{"$f":"ROUND(K47*I48,2)","v":5100}]
[null,null,null,null,null,null,"Genel Toplam:",null,null,null,{"$f":"K47+K48","v":30600}]
[]
[null,"Kayalar Orman Ürünleri San. Tic. Ltd. Şti."]
[null,"M. Kemal cd. No:106 Balçık köyü  Gebze / KOCAELİ    www.kayalarkereste.com    kayalarkereste@hotmail.com"]
[null,"Ziraat Bankası       şb: 2617-Güzelyalı        Hes No:69699580-5001             IBAN : TR32 0001 0026 1769 6995 8050 01"]
[null,null,"Yaşar Kaya :  0533 237 17 37       Baki KAYA : 0532 762 30 80          Süleyman KAYA : 0532 201 65 45"]

{"sheet":"Lamine","index":2,"n_rows":38,"n_cols":39,"rows_kept":38,"cut":false,"hidden":false,"merged":[[4,27,4,28],[34,21,34,22],[33,23,33,24],[34,23,34,24],[31,1,33,19],[4,1,4,2],[4,3,4,7],[4,9,4,16],[4,18,4,21],[4,24,5,24],[33,21,33,22],[32,23,32,24],[32,21,32,22],[34,1,34,7],[5,9,5,10],[35,1,35,15],[36,1,36,15],[37,1,37,15],[45,2,45,4],[0,2,0,6],[0,7,2,20],[5,12,5,13],[0,34,0,38],[1,2,1,6],[3,2,3,6],[3,7,3,20],[2,2,2,6]]}
[null,"Firma :",null,null,null,null,null,"Kayalar Ahşap",null,null,null,null,null,null,null,null,null,null,null,null,null,null,null,null,null,null,null,null,null,null,"Sınıf :","Cinsi : ",null,null,"Teslim Edilecek Ölçüler"]
[null,"Yetkili ;",null,null,null,null,null,null,null,null,null,null,null,null,null,null,null,null,null,null,null,null,null,null,null,null,null,null,null,null,"1-3 Sınıf","Lamine Kiriş",null,null,"En  -->","En",null,"KLN  -->","KLN"]
[null,"Tarih :",{"$f":"NOW()","v":"2025-01-30T01:22:58.410"},null,null,null,null,null,null,null,null,null,null,null,null,null,null,null,null,null,null,null,null,null,null,null,null,null,null,null,"1.Sınıf-U/S",null,null,null,15,14,null,6.3,5.5]
[null,"Mail :",null,null,null,null,null,"Orman Ürünleri İnş. San. Tic. Ltd. Şti.",null,null,null,null,null,null,null,null,null,null,null,null,null,null,null,null,null,null,null,null,null,null,"U/S Kalite",null,null,null,12.5,11.5,null,5,4.5]
[null,null,null,"İstenilen Ölçüler",null,null,null,null,null,"Hesaplanan Ölçüler",null,null,null,null,null,null,null,null,"Teslim Edilecek Ölçüler",null,null,null,null,"M3","Tutar",null,null,"MALİYET",null,null,"1. Sınıf",null,null,null,1,1,null,2,1.7]
[null,"Cinsi",null,"En","KLN","Boy","Adet ","Miktr M3",null,"En + En",null,null,"Kln x adt",null,null,"Boy","Miktr M3",null,"En","KLN","Boy","Miktr M3",null,"Fiyat",null,null,null,"Fiyat","Tutar",null,"Ladin Yerli",null,null,null,1,1,null,18.5,15]
[null,null,null," ",null,null,null,{"$f":"IFERROR(D7*E7*F7*G7/1000000,\"\")","v":""},null,null,null,null,null,null,null,null,{"$f":"IF(J7*M7*N7*P7*G7>1,J7*M7*N7*P7*G7/1000000,\"\")","v":""},null,null,null,{"$f":"IF(J7*N7*P7*G7>1,P7,\"\")","v":""},{"$f":"IFERROR(S7*T7*U7*G7/1000000,\"\")","v":""},null,null,{"$f":"IFERROR(X7*Q7,\"\")","v":""},null,null,2900,{"$f":"Q7*AB7","v":{"$error":"#VALUE!"}},null,"Ukrayna",null,null,null,1,1,null,1,1]
[null,null,null," ",null,null,null,"",null,null,null,null,null,null,null,null,{"$f":"IF(J8*M8*N8*P8*G8>1,J8*M8*N8*P8*G8/1000000,\"\")","v":""},null,null,null,"","",null,null,"",null,null,null,{"$f":"IFERROR(X8*Q8,\"\")","v":""},null,null,null,null,null,1,1,null,1,1]
[null,null,null," ",null,null,null,"",null,null,null,null,null,null,null,null,{"$f":"IF(J9*M9*N9*P9*G9>1,J9*M9*N9*P9*G9/1000000,\"\")","v":""},null,null,null,"","",null,null,"",null,null,null,{"$f":"IFERROR(X9*Q9,\"\")","v":""}]
[null,null,null," ",null,null,null,"",null,null,null,null,null,null,null,null,"",null,null,null,"","",null,null,"",null,null,null,{"$f":"IFERROR(X10*Q10,\"\")","v":""}]
[null,null,null," ",null,null,null,"",null,null,null,null,null,null,null,null,"",null,null,null,"","",null,null,"",null,null,null,""]
[null,null,null," ",null,null,null,"",null,null,null,null,null,null,null,null,"",null,null,null,"","",null,null,"",null,null,null,""]
[null,null,null," ",null,null,null,"",null,null,null,null,null,null,null,null,{"$f":"IF(J13*N13*P13*G13>1,J13*N13*P13*G13/1000000,\"\")","v":""},null,null,{"$f":"IFERROR(VLOOKUP(N13,AL:AM,2,FALSE),\"\")","v":""},"","",null,null,"",null,null,null,""]
[null,null,null," ",null,null,null,"",null,null,null,null,null,null,null,null,"",null,null,"","","",null,null,"",null,null,null,""]
[null,null,null," ",null,null,null,"",null,null,null,null,null,null,null,null,"",null,null,"","","",null,null,"",null,null,null,""]
[null,null,null," ",null,null,null,"",null,null,null,null,null,null,null,null,"",null,{"$f":"IFERROR(VLOOKUP(J16,AI:AJ,2,FALSE),\"\")","v":""},"","","",null,null,"",null,null,null,""]
[null,null,null," ",null,null,null,"",null,null,null,null,null,null,null,null,"",null,"","","","",null,null,"",null,null,null,""]
[null,null,null," ",null,null,null,"",null,null,null,null,null,null,null,null,"",null,"","","","",null,null,"",null,null,null,""]
[null,null,null," ",null,null,null,"",null,null,null,null,null,null,null,null,"",null,"","","","",null,null,"",null,null,null,""]
[null,null,null," ",null,null,null,"",null,null,null,null,null,null,null,null,"",null,"","","","",null,null,"",null,null,null,""]
[null,null,null," ",null,null,null,"",null,null,null,null,null,null,null,null,"",null,"","","","",null,null,"",null,null,null,""]
[null,null,null," ",null,null,null,"",null,null,null,null,null,null,null,null,"",null,"","","","",null,null,"",null,null,null,""]
[null,null,null," ",null,null,null,"",null,null,null,null,null,null,null,null,"",null,"","","","",null,null,"",null,null,null,""]
[null,null,null," ",null,null,null,"",null,null,null,null,null,null,null,null,"",null,"","","","",null,null,"",null,null,null,""]
[null,null,null," ",null,null,null,"",null,null,null,null,null,null,null,null,"",null,"","","","",null,null,"",null,null,null,""]
[null,null,null," ",null,null,null,"",null,null,null,null,null,null,null,null,"",null,"","","","",null,null,"",null,null,null,""]
[null,null,null," ",null,null,null,"",null,null,null,null,null,null,null,null,"",null,"","","","",null,null,"",null,null,null,""]
[null,null,null," ",null,null,null,"",null,null,null,null,null,null,null,null,"",null,"","","","",null,null,"",null,null,null,""]
[null,null,null," ",null,null,null,"",null,null,null,null,null,null,null,null,"",null,"","","","",null,null,"",null,null,null,""]
[null,null,null,null,null,null,{"$f":"SUM(G7:G29)","v":0},0,null,null,null,null,null,null,null,null,{"$f":"SUM(Q7:Q29)","v":0},null,null,null,null,{"$f":"SUM(V7:V29)","v":0}]
[]
[null,"** Teklife ait Lamine ürünler boy ekli olacaktır,   Teklife ait ölçüler de ±2 mm fark olabilir,  Üretimde kullanılacak keresteler ................... kalite mallarından yapılacaktır,  Üretilecek ürünler daldırma renkli emprenye ile emprenye yapılabilir ayrıca fiyat alınız. Fiyat hesaplama brüt ölçü üzerinde yapılır,  Teklifimiz tarafınızdan belirtilen ödeme planına göre hazırlanmıştır ve 5 iş gününe kadar geçerlidir."]
[null,null,null,null,null,null,null,null,null,null,null,null,null,null,null,null,null,null,null,null,null,"Toplam :",null,{"$f":"SUM(Y7:Y29)","v":0},null,null,null,null,{"$f":"SUM(AC7:AC29)","v":{"$error":"#VALUE!"}}]
[null,null,null,null,null,null,null,null,null,null,null,null,null,null,null,null,null,null,null,null,null,"KDV %18:",null,{"$f":"X33*0.18","v":0}]
[null,"Kayalar Orman Ürünleri San. Tic. Ltd. Şti.",null,null,null,null,null,null,null,null,null,null,null,null,null,null,null,null,null,null,null,"G.toplam:",null,{"$f":"X34+X33","v":0}]
[null,"Yaşar KAYA : 0533 237 17 37            Baki KAYA : 0532 762 30 80             Süleyman KAYA : 0532 201 65 45"]
[null,"M.Kemal cd. No:106 Balçık köyü  Gebze/KOCAELİ   www.kayalarkereste.com   kayalarkereste@hotmail.com"]
[null,"Ziraat Bankası     şb: 2617-Güzelyalı   Hes No:69699580-5001         IBAN : TR32 0001 0026 1769 6995 8050 01"]

{"sheet":"Kurlar","index":3,"n_rows":31,"n_cols":15,"rows_kept":31,"cut":false,"hidden":false,"merged":[]}
[null,null,null,null,null,null,null,null,null,"Usd",{"$f":"K9","v":"35.7710"},7316]
[null,null,null,null,null,null,null,null,null,"Euro",{"$f":"K12","v":"37.2534"}]
[]
[]
[]
[]
[null,null,null,null,null,null,null,null,null,null,"bu"]
["Tarih","Date","Bulten_No","CrossOrder","Kod","CurrencyCode","Unit","Isim","CurrencyName","ForexBuying","ForexSelling","BanknoteBuying","BanknoteSelling","CrossRateUSD","CrossRateOther"]
["29.01.2025","01/29/2025","2025/20",0,"USD","USD",1,"ABD DOLARI","US DOLLAR",35.706699999999998,"35.7710","35.6817","35.8247"]
["29.01.2025","01/29/2025","2025/20",1,"AUD","AUD",1,"AVUSTRALYA DOLARI","AUSTRALIAN DOLLAR",22.203299999999999,"22.3481","22.1012","22.4822","1.6044"]
["29.01.2025","01/29/2025","2025/20",2,"DKK","DKK",1,"DANİMARKA KRONU","DANISH KRONE",4.9753999999999996,"4.9999","4.9719","5.0114","7.1655"]
["29.01.2025","01/29/2025","2025/20",9,"EUR","EUR",1,"EURO","EURO",37.186500000000002,"37.2534","37.1604","37.3093",null,"1.0414"]
["29.01.2025","01/29/2025","2025/20",10,"GBP","GBP",1,"İNGİLİZ STERLİNİ","POUND STERLING",44.320399999999999,"44.5515","44.2894","44.6183",null,"1.2434"]
["29.01.2025","01/29/2025","2025/20",3,"CHF","CHF",1,"İSVİÇRE FRANGI","SWISS FRANK",39.335099999999997,"39.5877","39.2761","39.6471","0.9057"]
["29.01.2025","01/29/2025","2025/20",4,"SEK","SEK",1,"İSVEÇ KRONU","SWEDISH KRONA",3.2301000000000002,"3.2636","3.2279","3.2711","11.01"]
["29.01.2025","01/29/2025","2025/20",6,"CAD","CAD",1,"KANADA DOLARI","CANADIAN DOLLAR",24.7285,"24.8400","24.6370","24.9344","1.4420"]
["29.01.2025","01/29/2025","2025/20",11,"KWD","KWD",1,"KUVEYT DİNARI","KUWAITI DINAR",115.116,"116.6223","113.3893","118.3716",null,"3.2421"]
["29.01.2025","01/29/2025","2025/20",7,"NOK","NOK",1,"NORVEÇ KRONU","NORWEGIAN KRONE",3.1511,"3.1723","3.1489","3.1796","11.30"]
["29.01.2025","01/29/2025","2025/20",8,"SAR","SAR",1,"SUUDİ ARABİSTAN RİYALİ","SAUDI RIYAL",9.5198,"9.5369","9.4484","9.6085","3.7508"]
["29.01.2025","01/29/2025","2025/20",5,"JPY","JPY",100,"JAPON YENİ","JAPENESE YEN",22.936199999999999,"23.0881","22.8514","23.1759","155.30"]
["29.01.2025","01/29/2025","2025/20",12,"BGN","BGN",1,"BULGAR LEVASI","BULGARIAN LEV",18.906099999999999,"19.1535",null,null,"1.8781"]
["29.01.2025","01/29/2025","2025/20",13,"RON","RON",1,"RUMEN LEYİ","NEW LEU",7.4326999999999996,"7.5299",null,null,"4.7771"]
["29.01.2025","01/29/2025","2025/20",14,"RUB","RUB",1,"RUS RUBLESİ","RUSSIAN ROUBLE",0.36209000000000002,"0.36683",null,null,"98.06"]
["29.01.2025","01/29/2025","2025/20",15,"IRR","IRR",100,"İRAN RİYALİ","IRANIAN RIAL",8.0300000000000007E-3,"0.00814",null,null,"442081"]
["29.01.2025","01/29/2025","2025/20",16,"CNY","CNY",1,"ÇİN YUANI","CHINESE RENMINBI",4.8964999999999996,"4.9606",null,null,"7.2514"]
["29.01.2025","01/29/2025","2025/20",17,"PKR","PKR",1,"PAKİSTAN RUPİSİ","PAKISTANI RUPEE",0.12734999999999999,"0.12902",null,null,"278.80"]
["29.01.2025","01/29/2025","2025/20",18,"QAR","QAR",1,"KATAR RİYALİ","QATARI RIAL",9.7390000000000008,"9.8665",null,null,"3.6458"]
["29.01.2025","01/29/2025","2025/20",19,"KRW","KRW",1,"GÜNEY KORE WONU","SOUTH KOREAN WON",2.4570000000000002E-2,"0.02489",null,null,"1445"]
["29.01.2025","01/29/2025","2025/20",20,"AZN","AZN",1,"AZERBAYCAN YENİ MANATI","AZERBAIJANI NEW MANAT",20.886199999999999,"21.1595",null,null,"1.7000"]
["29.01.2025","01/29/2025","2025/20",21,"AED","AED",1,"BİRLEŞİK ARAP EMİRLİKLERİ DİRHEMİ","UNITED ARAB EMIRATES DIRHAM",9.6670999999999996,"9.7936",null,null,"3.6729"]
["29.01.2025","01/29/2025","2025/20",0,"XDR","XDR",1,"ÖZEL ÇEKME HAKKI (SDR)","SPECIAL DRAWING RIGHT (SDR)",46.6813,null,null,null,null,"1.30618"]